./configure
=ok
@ make check
make[2]: Leaving directory `/home/user/temp/pango-1.14.0/modules/tibetan'
make[2]: Entering directory `/home/user/temp/pango-1.14.0/modules'
Writing a pango.modules file to use with tests/examples.
/home/user/temp/pango-1.14.0/pango/.libs/lt-pango-querymodules: symbol lookup error: /home/user/temp/pango-1.14.0/pango/.libs/libpango-1.0.so.0: undefined symbol: g_intern_static_string
make[2]: *** [pango.modules] Error 127
make[2]: Leaving directory `/home/user/temp/pango-1.14.0/modules'
make[1]: *** [check-recursive] Error 1
make[1]: Leaving directory `/home/user/temp/pango-1.14.0/modules'
make: *** [check-recursive] Error 1
OpenSuse 10.1
=ok
@ make check
make[2]: Leaving directory `/home/user/temp/pango-1.14.0/modules/tibetan'
make[2]: Entering directory `/home/user/temp/pango-1.14.0/modules'
Writing a pango.modules file to use with tests/examples.
/home/user/temp/pango-1.14.0/pango/.libs/lt-pango-querymodules: symbol lookup error: /home/user/temp/pango-1.14.0/pango/.libs/libpango-1.0.so.0: undefined symbol: g_intern_static_string
make[2]: *** [pango.modules] Error 127
make[2]: Leaving directory `/home/user/temp/pango-1.14.0/modules'
make[1]: *** [check-recursive] Error 1
make[1]: Leaving directory `/home/user/temp/pango-1.14.0/modules'
make: *** [check-recursive] Error 1
OpenSuse 10.1
Vastaukset 1
Vanhimmat
...